Target
Acetyl-CoA carboxylase 2
Ligand
BDBM230456
Substrate
Meas. Tech.
Spectrophotometric 384 Well Assay
pH
7.5±n/a
IC50
29±n/a nM
Comments
extracted
Citation
 Roth, GJFleck, MHaebel, PWHeimann, AHeine, N Tetrahydroisoquinoline derivatives, pharmaceutical compositions and uses thereof US Patent  US9340510 Publication Date 5/17/2016 
Target
Name:
Acetyl-CoA carboxylase 2
Synonyms:
ACACB ACC-beta ACCB Acetyl-CoA carboxylase 2 Acetyl-CoA carboxylase 2 (ACC2)
Type:
Protein
Mol. Mass.:
276535.21
Organism:
Homo sapiens (Human)
Description:
O00763
Residue:
2458
  
Inhibitor
Name:
BDBM230456
Synonyms:
US9340510, 1.060
Type:
Small organic molecule
Emp. Form.:
C26H29F3N2O2
Mol. Mass.:
458.5159
SMILES:
C[C@H](NC(=O)C1CC1)c1ccc(CN2CC(F)c3cc(OCC4CC4(F)F)ccc3C2)cc1
: