Target
Acetyl-CoA carboxylase 2
Ligand
BDBM230558
Substrate
Meas. Tech.
Spectrophotometric 384 Well Assay
pH
7.5±n/a
IC50
24±n/a nM
Comments
extracted
Citation
 Roth, GJFleck, MHaebel, PWHeimann, AHeine, N Tetrahydroisoquinoline derivatives, pharmaceutical compositions and uses thereof US Patent  US9340510 Publication Date 5/17/2016 
Target
Name:
Acetyl-CoA carboxylase 2
Synonyms:
ACACB ACC-beta ACCB Acetyl-CoA carboxylase 2 Acetyl-CoA carboxylase 2 (ACC2)
Type:
Protein
Mol. Mass.:
276535.21
Organism:
Homo sapiens (Human)
Description:
O00763
Residue:
2458
  
Inhibitor
Name:
BDBM230558
Synonyms:
US9340510, 3.015
Type:
Small organic molecule
Emp. Form.:
C27H32F2N2O2
Mol. Mass.:
454.552
SMILES:
C[C@H](NC(=O)C1(C)CC1)c1ccc(CN2CCc3cc(OCC4CC4(F)F)ccc3C2)cc1
: