Target
Insulin receptor
Ligand
BDBM291971
Substrate
Meas. Tech.
Inhibition of ALK IR Anaplastic Lymphoma Kinase Activity
IC50
2.10±n/a nM
Citation
 Kim, PKim, HRCho, SYHa, JDJung, HJYun, CSHwang, JYPark, CHLee, COAhn, SChae, CH N2-(2-methoxyphenyl)pyrimidine derivative, method for preparing same, and pharmaceutical composition for cancer prevention or treatment containing same as active ingredient US Patent  US10100019 Publication Date 10/16/2018 
Target
Name:
Insulin receptor
Synonyms:
INSR INSR_HUMAN Insulin receptor beta subunit
Type:
Receptor Tyrosine Kinase
Mol. Mass.:
156322.60
Organism:
Homo sapiens (Human)
Description:
P06213
Residue:
1382
  
Inhibitor
Name:
BDBM291971
Synonyms:
US10100019, Example 41
Type:
Small organic molecule
Emp. Form.:
C23H28ClN5O3S
Mol. Mass.:
490.018
SMILES:
COc1ccc(CCCN)cc1Nc1ncc(Cl)c(Nc2ccccc2S(=O)(=O)C(C)C)n1
: