Target
Sodium channel protein type 9 subunit alpha
Ligand
BDBM231255
Substrate
Meas. Tech.
In Vitro Assay
IC50
7.83±n/a nM
Citation
 Boezio, CBoezio, ABregman, HChakka, NCoats, JRCopeland, KWDimauro, EFDineen, TGao, HLa, DMarx, IENguyen, HNPeterson, EAWeiss, M Dihydrobenzoxazine and tetrahydroquinoxaline sodium channel inhibitors US Patent  US9346798 Publication Date 5/24/2016 
Target
Name:
Sodium channel protein type 9 subunit alpha
Synonyms:
NENA Peripheral sodium channel 1 SCN9A_HUMAN Voltage-gated sodium channel subunit Nav1.7 hNE-Na
Type:
Protein
Mol. Mass.:
226375.97
Organism:
Homo sapiens (Human)
Description:
Q15858
Residue:
1988
  
Inhibitor
Name:
BDBM231255
Synonyms:
US9346798, 2
Type:
Small organic molecule
Emp. Form.:
C17H12ClF3N4O3S2
Mol. Mass.:
476.88
SMILES:
FC(F)(F)c1ccc(N2CCOc3cc(ccc23)S(=O)(=O)Nc2ncns2)c(Cl)c1
: