Target
Sodium channel protein type 9 subunit alpha
Ligand
BDBM231305
Substrate
Meas. Tech.
In Vitro Assay
IC50
4.5±n/a nM
Citation
 Boezio, CBoezio, ABregman, HChakka, NCoats, JRCopeland, KWDimauro, EFDineen, TGao, HLa, DMarx, IENguyen, HNPeterson, EAWeiss, M Dihydrobenzoxazine and tetrahydroquinoxaline sodium channel inhibitors US Patent  US9346798 Publication Date 5/24/2016 
Target
Name:
Sodium channel protein type 9 subunit alpha
Synonyms:
NENA Peripheral sodium channel 1 SCN9A_HUMAN Voltage-gated sodium channel subunit Nav1.7 hNE-Na
Type:
Protein
Mol. Mass.:
226375.97
Organism:
Homo sapiens (Human)
Description:
Q15858
Residue:
1988
  
Inhibitor
Name:
BDBM231305
Synonyms:
US9346798, 52
Type:
Small organic molecule
Emp. Form.:
C22H21ClN4O3S2
Mol. Mass.:
489.01
SMILES:
Clc1ccc(N2CCOc3cc(ccc23)S(=O)(=O)Nc2nccs2)c(c1)C1=CCNCC1
: