Target
Sodium channel protein type 9 subunit alpha
Ligand
BDBM231464
Substrate
Meas. Tech.
In Vitro Assay
IC50
5.5±n/a nM
Citation
 Boezio, CBoezio, ABregman, HChakka, NCoats, JRCopeland, KWDimauro, EFDineen, TGao, HLa, DMarx, IENguyen, HNPeterson, EAWeiss, M Dihydrobenzoxazine and tetrahydroquinoxaline sodium channel inhibitors US Patent  US9346798 Publication Date 5/24/2016 
Target
Name:
Sodium channel protein type 9 subunit alpha
Synonyms:
NENA Peripheral sodium channel 1 SCN9A_HUMAN Voltage-gated sodium channel subunit Nav1.7 hNE-Na
Type:
Protein
Mol. Mass.:
226375.97
Organism:
Homo sapiens (Human)
Description:
Q15858
Residue:
1988
  
Inhibitor
Name:
BDBM231464
Synonyms:
US9346798, 211
Type:
Small organic molecule
Emp. Form.:
C20H18F3N3O4S2
Mol. Mass.:
485.5
SMILES:
OCCc1cc(ccc1N1CCOc2cc(ccc12)S(=O)(=O)Nc1nccs1)C(F)(F)F
: