Target
Sodium channel protein type 9 subunit alpha
Ligand
BDBM231470
Substrate
Meas. Tech.
In Vitro Assay
IC50
8±n/a nM
Citation
 Boezio, CBoezio, ABregman, HChakka, NCoats, JRCopeland, KWDimauro, EFDineen, TGao, HLa, DMarx, IENguyen, HNPeterson, EAWeiss, M Dihydrobenzoxazine and tetrahydroquinoxaline sodium channel inhibitors US Patent  US9346798 Publication Date 5/24/2016 
Target
Name:
Sodium channel protein type 9 subunit alpha
Synonyms:
NENA Peripheral sodium channel 1 SCN9A_HUMAN Voltage-gated sodium channel subunit Nav1.7 hNE-Na
Type:
Protein
Mol. Mass.:
226375.97
Organism:
Homo sapiens (Human)
Description:
Q15858
Residue:
1988
  
Inhibitor
Name:
BDBM231470
Synonyms:
US9346798, 217
Type:
Small organic molecule
Emp. Form.:
C19H15FN4O4S2
Mol. Mass.:
446.475
SMILES:
COc1cc(ccc1N1CCOc2cc(c(F)cc12)S(=O)(=O)Nc1nccs1)C#N
: