Target
Enoyl-[acyl-carrier-protein] reductase [NADH] FabI
Ligand
BDBM190654
Substrate
Meas. Tech.
Inhibition Kinetics Assay
pH
7.5±n/a
Ki
202.6±8.3 nM
Comments
extracted
Citation
 Schiebel, JChang, AShah, SLu, YLiu, LPan, PHirschbeck, MWTareilus, MEltschkner, SYu, WCummings, JEKnudson, SEBommineni, GRWalker, SGSlayden, RASotriffer, CATonge, PJKisker, C Rational design of broad spectrum antibacterial activity based on a clinically relevant enoyl-acyl carrier protein (ACP) reductase inhibitor. J Biol Chem 289:15987-6005 (2014)  
Target
Name:
Enoyl-[acyl-carrier-protein] reductase [NADH] FabI
Synonyms:
Enoyl - (acyl carrier protein) reductase Enoyl-[acyl-carrier-protein] reductase FABI_ECOLI envM | fabI
Type:
Enzyme
Mol. Mass.:
27861.12
Organism:
Escherichia coli
Description:
Residue:
262
  
Inhibitor
Name:
BDBM190654
Synonyms:
PT173
Type:
Small organic molecule
Emp. Form.:
C19H26N2O
Mol. Mass.:
298.4225
SMILES:
CCCCCCc1ccn(Cc2cccc(N)c2C)c(=O)c1
: