Target
EEF1AKMT4-ECE2 readthrough transcript protein
Ligand
BDBM231638
Substrate
Meas. Tech.
Enzyme Activity Assay
pH
5.5±0
IC50
5± 1 nM
Citation
 Gupta, AGomes, IWardman, JDevi, LA Opioid receptor function is regulated by post-endocytic peptide processing. J Biol Chem 289:19613-26 (2014)  
Target
Name:
EEF1AKMT4-ECE2 readthrough transcript protein
Synonyms:
EEF1AKMT4-ECE2 Endothelin-converting enzyme 2 Endothelin-converting enzyme 2 (ECE2) | Endothelin-converting enzyme 2 region
Type:
Enzyme
Mol. Mass.:
99745.05
Organism:
Homo sapiens (Human)
Description:
P0DPD8
Residue:
883
  
Inhibitor
Name:
BDBM231638
Synonyms:
SM19712
Type:
Small organic molecule
Emp. Form.:
C12H9ClN5O3S
Mol. Mass.:
338.75
SMILES:
Cc1[nH]nc(NC(=O)[N-]S(=O)(=O)c2ccc(Cl)cc2)c1C#N
: