Target
Ectonucleotide pyrophosphatase/phosphodiesterase family member 2
Ligand
BDBM232961
Substrate
Meas. Tech.
Inhibition Assay
pH
9±n/a
IC50
3.8±n/a nM
Comments
extracted
Citation
 Ohata, ANakatani, SSugiyama, TMorimoto, T Tetrahydrocarboline derivative US Patent  US9353113 Publication Date 5/31/2016 
Target
Name:
Ectonucleotide pyrophosphatase/phosphodiesterase family member 2
Synonyms:
ATX Autotaxin (ATX) ENPP2 Ectonucleotide Pyrophosphatase/Phosphodiesterase 2 (ENPP2) Extracellular lysophospholipase D PDNP2
Type:
Enzyme
Mol. Mass.:
99007.13
Organism:
Homo sapiens (Human)
Description:
Q13822
Residue:
863
  
Inhibitor
Name:
BDBM232961
Synonyms:
US9353113, 10(5)
Type:
Small Organic Molecule
Emp. Form.:
C25H27F3N4O3S
Mol. Mass.:
520.567
SMILES:
C[C@@]1(CC[C@H](CC(=O)N2CCc3c(C2)n(Cc2cnc(s2)C(F)(F)F)c2ncccc32)CC1)C(O)=O
: