Target
Serine/threonine-protein kinase pim-2
Ligand
BDBM162029
Substrate
Meas. Tech.
PIM-2 Biochemical Assay
IC50
550±n/a nM
Target
Name:
Serine/threonine-protein kinase pim-2
Synonyms:
PIM2 Pim-2h Serine/threonine-protein kinase PIM | Serine/threonine-protein kinase pim-2 (PIM2)
Type:
Serine/threonine-protein kinase
Mol. Mass.:
34185.93
Organism:
Homo sapiens (Human)
Description:
Q9P1W9
Residue:
311
  
Inhibitor
Name:
BDBM162029
Synonyms:
US9682991, 85
Type:
Small organic molecule
Emp. Form.:
C24H30F3N7O2
Mol. Mass.:
505.5359
SMILES:
CC(C)NCC1CCN(CC1)c1nn2c(nnc2c2OCCN(C)c12)-c1cccc(OC(F)(F)F)c1
: