Target
Serine/threonine-protein kinase pim-3
Ligand
BDBM162029
Substrate
Meas. Tech.
PIM-3 Biochemical Assay
IC50
550±n/a nM
Target
Name:
Serine/threonine-protein kinase pim-3
Synonyms:
PIM3 Serine/threonine-protein kinase pim-3 (PIM3)
Type:
Protein
Mol. Mass.:
35888.19
Organism:
Homo sapiens (Human)
Description:
Q86V86
Residue:
326
  
Inhibitor
Name:
BDBM162029
Synonyms:
US9682991, 85
Type:
Small organic molecule
Emp. Form.:
C24H30F3N7O2
Mol. Mass.:
505.5359
SMILES:
CC(C)NCC1CCN(CC1)c1nn2c(nnc2c2OCCN(C)c12)-c1cccc(OC(F)(F)F)c1
: