Target
Urease
Ligand
BDBM233146
Substrate
Meas. Tech.
Urease Inhibition Assay
IC50
1.89e+4± 188 nM
Citation
 Akhtar, THameed, SKhan, KMKhan, AChoudhary, MI Design, synthesis, and urease inhibition studies of some 1,3,4-oxadiazoles and 1,2,4-triazoles derived from mandelic acid. J Enzyme Inhib Med Chem 25:572-6 (2010)  
Target
Name:
Urease
Synonyms:
UREA_CANEN | Urea amidohydrolase
Type:
Enzyme
Mol. Mass.:
90746.20
Organism:
Canavalia ensiformis (Jack bean) (Horse bean)
Description:
P07374
Residue:
840
  
Inhibitor
Name:
BDBM233146
Synonyms:
5-(Hydroxybenzyl)-4-(4-chlorophenyl)-2H-1,2,4-triazole-3-thione (5b)
Type:
Small organic molecule
Emp. Form.:
C15H12ClN3OS
Mol. Mass.:
317.793
SMILES:
OC(c1n[nH]c(=S)n1-c1ccc(Cl)cc1)c1ccccc1
: