Target
Urease
Ligand
BDBM233148
Substrate
Meas. Tech.
Urease Inhibition Assay
IC50
1.317e+5± 1546 nM
Citation
 Akhtar, THameed, SKhan, KMKhan, AChoudhary, MI Design, synthesis, and urease inhibition studies of some 1,3,4-oxadiazoles and 1,2,4-triazoles derived from mandelic acid. J Enzyme Inhib Med Chem 25:572-6 (2010)  
Target
Name:
Urease
Synonyms:
UREA_CANEN | Urea amidohydrolase
Type:
Enzyme
Mol. Mass.:
90746.20
Organism:
Canavalia ensiformis (Jack bean) (Horse bean)
Description:
P07374
Residue:
840
  
Inhibitor
Name:
BDBM233148
Synonyms:
5-(Hydroxybenzyl)-4-(4-nitrophenyl)-2H-1,2,4-triazole-3-thione (5e)
Type:
Small organic molecule
Emp. Form.:
C15H12N4O3S
Mol. Mass.:
328.346
SMILES:
OC(c1n[nH]c(=S)n1-c1ccc(cc1)[N+]([O-])=O)c1ccccc1
: