Target
Glutathione S-transferase P
Ligand
BDBM50095998
Substrate
Meas. Tech.
GST Assay
IC50
1.31e+5±n/a nM
Citation
 Mangoyi, RHayeshi, RNgadjui, BNgandeu, FBezabih, MAbegaz, BRazafimahefa, SRasoanaivo, PMukanganyama, S Glutathione transferase from Plasmodium falciparum--interaction with malagashanine and selected plant natural products. J Enzyme Inhib Med Chem 25:854-62 (2010)  
Target
Name:
Glutathione S-transferase P
Synonyms:
FAEES3 GST3 GSTP1-1 Glutathione S-transferase Glutathione S-transferase P Glutathione transferase (GST)
Type:
Enzyme
Mol. Mass.:
23353.53
Organism:
Homo sapiens (Human)
Description:
P09211
Residue:
210
  
Inhibitor
Name:
BDBM50095998
Synonyms:
CHEMBL345292 L-gamma-glutamyl-S-hexyl-L-cysteinylglycine | S-hexylglutathione
Type:
Small organic molecule
Emp. Form.:
C16H29N3O6S
Mol. Mass.:
391.483
SMILES:
CCCCCCSC[C@H](NC(=O)CC[C@H](N)C(O)=O)C(=O)NCC(O)=O
: