Target
D(1A) dopamine receptor
Ligand
BDBM86180
Substrate
Meas. Tech.
Reception Binding Assay
Temperature
303.15±n/a K
Ki
1.24±n/a nM
IC50
2.52±n/a nM
Comments
extracted
Citation
 Liu, HXie, XZhen, XSun, HLi, JZhu, LLi, ZChen, YJiang, HChen, K Hexahydrodibenzo[a,g]quinolizine compound, preparation method thereof, pharmaceutical composition and use thereof US Patent  US9359372 Publication Date 6/7/2016 
Target
Name:
D(1A) dopamine receptor
Synonyms:
DA D1 receptor DRD1 Dopamine D1 receptor Dopamine D1A
Type:
Enzyme
Mol. Mass.:
49303.43
Organism:
Homo sapiens (Human)
Description:
P21728
Residue:
446
  
Inhibitor
Name:
BDBM86180
Synonyms:
CAS_87075-17-0 SCH 23390 US9359372, SCH23390
Type:
Small organic molecule
Emp. Form.:
C17H18ClNO
Mol. Mass.:
287.784
SMILES:
CN1CCc2cc(Cl)c(O)cc2C(C1)c1ccccc1
: