Target
Genome polyprotein [1027-3010]
Ligand
BDBM236569
Substrate
Meas. Tech.
Replicon Assay
EC50
6.3±n/a nM
Citation
 Raboisson, PJDe Kock, HAMcGowan, DCHu, LTahri, AVendeville, SMVan De Vreken, W Macrocyclic inhibitors of hepatitis C virus US Patent  US9365582 Publication Date 6/14/2016 
Target
Name:
Genome polyprotein [1027-3010]
Synonyms:
NS3-NS5B | POLG_HCVCO
Type:
Enzyme
Mol. Mass.:
214688.96
Organism:
Hepatitis C virus genotype 1b (isolate Con1) (HCV)
Description:
NS3-NS5B regions (aa 1027-3010)
Residue:
1984
  
Inhibitor
Name:
BDBM236569
Synonyms:
US9365582, 11
Type:
Small organic molecule
Emp. Form.:
C32H39ClN4O7S
Mol. Mass.:
659.193
SMILES:
CCOc1cc(O[C@@H]2C[C@@H]3[C@@H](C2)C(=O)N(C)CCCC\C=C/[C@@H]2C[C@]2(NC3=O)C(=O)NS(=O)(=O)C2CC2)c2cccc(Cl)c2n1
: