Target
Epidermal growth factor receptor
Ligand
BDBM50154284
Substrate
Meas. Tech.
Kinase-Glo luminescent kinase assay
IC50
<200±n/a nM
Citation
 Sheng, WYang, LPan, Z Quinazoline heterocyclic compound as EGFR kinase inhibitor and preparation and application thereof US Patent  US10106508 Publication Date 10/23/2018 
Target
Name:
Epidermal growth factor receptor
Synonyms:
EGF Receptor Substrate EGFR_HUMAN ERBB1 Epidermal Growth Factor Receptor erbB-1 Epidermal growth factor receptor (EGFR) HER1 Proto-oncogene c-ErbB-1 Tyrosine-Protein Kinase ErbB-1
Type:
Receptor Kinase Domain
Mol. Mass.:
134279.59
Organism:
Homo sapiens (Human)
Description:
P00533
Residue:
1210
  
Inhibitor
Name:
BDBM50154284
Synonyms:
CHEMBL3775664 | US10106508, Compound II-2
Type:
Small organic molecule
Emp. Form.:
C23H23ClFN5O3
Mol. Mass.:
471.912
SMILES:
Fc1ccc(Nc2ncnc3cc4OCC(=O)N(CCCN5CCOCC5)c4cc23)cc1Cl
: