Target
Carbonic anhydrase 2
Ligand
BDBM10860
Substrate
BDBM237235
Meas. Tech.
CA Activity Assay
pH
7.4±0
Temperature
298.15±0 K
Ki
612±n/a nM
Citation
 Ekinci, DAl-Rashida, MAbbas, GSentürk, MSupuran, CT Chromone containing sulfonamides as potent carbonic anhydrase inhibitors. J Enzyme Inhib Med Chem 27:744-7 (2012)  
Target
Name:
Carbonic anhydrase 2
Synonyms:
CA-II CAC Carbonate dehydratase II Carbonic anhydrase 2 (CA-II) Carbonic anhydrase C Carbonic anhydrase II (CA-II) Carbonic anhydrase II (hCA II) | Carbonic anhydrase isoenzyme II (hCA II)
Type:
Enzyme
Mol. Mass.:
29250.71
Organism:
Homo sapiens (Human)
Description:
P00918
Residue:
260
  
Inhibitor
Name:
BDBM10860
Synonyms:
4-(aminomethyl)benzene-1-sulfonamide MAFENIDE aromatic/heteroaromatic sulfonamide 5 | hCA inhibitor, 9
Type:
Small organic molecule
Emp. Form.:
C7H10N2O2S
Mol. Mass.:
186.232
SMILES:
NCc1ccc(cc1)S(N)(=O)=O
:
Substrate
Name:
BDBM237235
Synonyms:
4-Nitrophenylacetate
Type:
Small organic molecule
Emp. Form.:
C8H7NO4
Mol. Mass.:
181.1455
SMILES:
OC(=O)Cc1ccc(cc1)[N+]([O-])=O
: