Target
Prostaglandin E2 receptor EP2 subtype
Ligand
BDBM238314
Substrate
Meas. Tech.
Radioligand Binding Assay
Ki
>10000±n/a nM
Citation
 Donde, YNguyen, JH Therapeutic prostaglandin receptor agonists US Patent  US9394273 Publication Date 7/19/2016 
Target
Name:
Prostaglandin E2 receptor EP2 subtype
Synonyms:
PE2R2_HUMAN PTGER2 Prostaglandin E2 receptor Prostanoid EP2 Receptor
Type:
Enzyme
Mol. Mass.:
39775.71
Organism:
Homo sapiens (Human)
Description:
P43116
Residue:
358
  
Inhibitor
Name:
BDBM238314
Synonyms:
US9394273, 3 | US9394273, 4
Type:
Small organic molecule
Emp. Form.:
C26H25ClO4S
Mol. Mass.:
468.992
SMILES:
OC(Cc1sc2ccccc2c1Cl)\C=C\[C@H]1CCC(=O)[C@@H]1CCc1ccc(cc1)C(O)=O
: