Target
Prostaglandin E2 receptor EP2 subtype
Ligand
BDBM238338
Substrate
Meas. Tech.
Radioligand Binding Assay
Ki
3632±n/a nM
Citation
 Donde, YNguyen, JH Therapeutic prostaglandin receptor agonists US Patent  US9394273 Publication Date 7/19/2016 
Target
Name:
Prostaglandin E2 receptor EP2 subtype
Synonyms:
PE2R2_HUMAN PTGER2 Prostaglandin E2 receptor Prostanoid EP2 Receptor
Type:
Enzyme
Mol. Mass.:
39775.71
Organism:
Homo sapiens (Human)
Description:
P43116
Residue:
358
  
Inhibitor
Name:
BDBM238338
Synonyms:
US9394273, 27 | US9394273, 28
Type:
Small organic molecule
Emp. Form.:
C24H24F2O4
Mol. Mass.:
414.4418
SMILES:
OC(Cc1cc(F)ccc1F)\C=C\[C@H]1CCC(=O)[C@@H]1CCc1ccc(cc1)C(O)=O
: