Target
Prostaglandin E2 receptor EP4 subtype
Ligand
BDBM238334
Substrate
Meas. Tech.
cAMP Assay
pH
7.4±n/a
Temperature
298.15±n/a K
EC50
21±n/a nM
Comments
extracted
Citation
 Donde, YNguyen, JH Therapeutic prostaglandin receptor agonists US Patent  US9394273 Publication Date 7/19/2016 
Target
Name:
Prostaglandin E2 receptor EP4 subtype
Synonyms:
PE2R4_HUMAN PGE2 receptor EP4 subtype PTGER4 Prostanoid EP4 receptor
Type:
Enzyme
Mol. Mass.:
53134.53
Organism:
Homo sapiens (Human)
Description:
P35408
Residue:
488
  
Inhibitor
Name:
BDBM238334
Synonyms:
US9394273, 23 | US9394273, 24
Type:
Small organic molecule
Emp. Form.:
C24H24F2O4
Mol. Mass.:
414.4418
SMILES:
OC(Cc1ccc(F)c(F)c1)\C=C\[C@H]1CCC(=O)[C@@H]1CCc1ccc(cc1)C(O)=O
: