Target
Prostaglandin E2 receptor EP4 subtype
Ligand
BDBM238322
Substrate
Meas. Tech.
Radioligand Binding Assay
Ki
1±n/a nM
Citation
 Donde, YNguyen, JH Therapeutic prostaglandin receptor agonists US Patent  US9394273 Publication Date 7/19/2016 
Target
Name:
Prostaglandin E2 receptor EP4 subtype
Synonyms:
PE2R4_HUMAN PGE2 receptor EP4 subtype PTGER4 Prostanoid EP4 receptor
Type:
Enzyme
Mol. Mass.:
53134.53
Organism:
Homo sapiens (Human)
Description:
P35408
Residue:
488
  
Inhibitor
Name:
BDBM238322
Synonyms:
US9394273, 11 | US9394273, 12
Type:
Small organic molecule
Emp. Form.:
C25H25F3O4
Mol. Mass.:
446.4588
SMILES:
OC(Cc1cccc(c1)C(F)(F)F)\C=C\[C@H]1CCC(=O)[C@@H]1CCc1ccc(cc1)C(O)=O
: