Target
Prostaglandin E2 receptor EP4 subtype
Ligand
BDBM238326
Substrate
Meas. Tech.
Radioligand Binding Assay
Ki
41±n/a nM
Citation
 Donde, YNguyen, JH Therapeutic prostaglandin receptor agonists US Patent  US9394273 Publication Date 7/19/2016 
Target
Name:
Prostaglandin E2 receptor EP4 subtype
Synonyms:
PE2R4_HUMAN PGE2 receptor EP4 subtype PTGER4 Prostanoid EP4 receptor
Type:
Enzyme
Mol. Mass.:
53134.53
Organism:
Homo sapiens (Human)
Description:
P35408
Residue:
488
  
Inhibitor
Name:
BDBM238326
Synonyms:
US9394273, 15
Type:
Small organic molecule
Emp. Form.:
C26H26O4S
Mol. Mass.:
434.547
SMILES:
OC(Cc1ccc2ccsc2c1)\C=C\[C@H]1CCC(=O)[C@@H]1CCc1ccc(cc1)C(O)=O
: