Target
Prostaglandin E2 receptor EP4 subtype
Ligand
BDBM238338
Substrate
Meas. Tech.
Radioligand Binding Assay
Ki
5±n/a nM
Citation
 Donde, YNguyen, JH Therapeutic prostaglandin receptor agonists US Patent  US9394273 Publication Date 7/19/2016 
Target
Name:
Prostaglandin E2 receptor EP4 subtype
Synonyms:
PE2R4_HUMAN PGE2 receptor EP4 subtype PTGER4 Prostanoid EP4 receptor
Type:
Enzyme
Mol. Mass.:
53134.53
Organism:
Homo sapiens (Human)
Description:
P35408
Residue:
488
  
Inhibitor
Name:
BDBM238338
Synonyms:
US9394273, 27 | US9394273, 28
Type:
Small organic molecule
Emp. Form.:
C24H24F2O4
Mol. Mass.:
414.4418
SMILES:
OC(Cc1cc(F)ccc1F)\C=C\[C@H]1CCC(=O)[C@@H]1CCc1ccc(cc1)C(O)=O
: