Target
Thromboxane A2 receptor
Ligand
BDBM238334
Substrate
Meas. Tech.
FLIPR Assay
pH
7.4±n/a
EC50
2446±n/a nM
Comments
extracted
Citation
 Donde, YNguyen, JH Therapeutic prostaglandin receptor agonists US Patent  US9394273 Publication Date 7/19/2016 
Target
Name:
Thromboxane A2 receptor
Synonyms:
Prostanoid TP receptor TBXA2R Thromboxane Thromboxane Beta
Type:
Enyzme
Mol. Mass.:
37445.28
Organism:
Homo sapiens (Human)
Description:
P21731
Residue:
343
  
Inhibitor
Name:
BDBM238334
Synonyms:
US9394273, 23 | US9394273, 24
Type:
Small organic molecule
Emp. Form.:
C24H24F2O4
Mol. Mass.:
414.4418
SMILES:
OC(Cc1ccc(F)c(F)c1)\C=C\[C@H]1CCC(=O)[C@@H]1CCc1ccc(cc1)C(O)=O
: