Target
Tyrosine-protein kinase JAK2
Ligand
BDBM237732
Substrate
Meas. Tech.
Biochemical HTRF Assay
IC50
756±n/a nM
Citation
 Brubaker, JClose, JSiu, TSmith, GFTorres, LEWoo, HCYoung, JRWei, ZShi, F Pyrazole carboxamides as Janus kinase inhibitors US Patent  US9394282 Publication Date 7/19/2016 
Target
Name:
Tyrosine-protein kinase JAK2
Synonyms:
JAK-2 JAK2_HUMAN Janus kinase 2 (JAK2) | Janus kinase 2 (a protein tyrosine kinase)
Type:
Protein
Mol. Mass.:
130684.68
Organism:
Homo sapiens (Human)
Description:
O60674
Residue:
1132
  
Inhibitor
Name:
BDBM237732
Synonyms:
US9394282, 5-11
Type:
Small organic molecule
Emp. Form.:
C22H25FN6O3
Mol. Mass.:
440.4707
SMILES:
NC(=O)c1cn(nc1Nc1ccc(F)cc1)[C@@H]1CCN(C[C@H]1C#N)C(=O)OC1CCCC1
: