Target
Macrophage colony-stimulating factor 1 receptor
Ligand
BDBM238126
Substrate
Meas. Tech.
Fluorescence Polarization Competition Immunoassay
pH
7.5±n/a
Temperature
298.15±n/a K
IC50
0.8±n/a nM
Comments
extracted
Citation
 Illig, CRBallentine, SKChen, JDesjarlais, RLMeegalla, SKWall, MWilson, KTomczuk, BE Inhibitors of c-fms kinase US Patent  US9394289 Publication Date 7/19/2016 
Target
Name:
Macrophage colony-stimulating factor 1 receptor
Synonyms:
CSF1R_MOUSE Csfmr Macrophage colony-stimulating factor 1 receptor Proto-oncogene c-Fms
Type:
Protein
Mol. Mass.:
109173.45
Organism:
Mus musculus (Mouse)
Description:
P09581
Residue:
977
  
Inhibitor
Name:
BDBM238126
Synonyms:
US9394289, 22
Type:
Small organic molecule
Emp. Form.:
C25H28N8O2
Mol. Mass.:
472.5422
SMILES:
CC1(C)CCC(=CC1)c1cc(ccc1NC(=O)c1nc(c[nH]1)C#N)C1(CCOCC1)c1nn[nH]n1
: