Target
Lysine-specific demethylase 4C
Ligand
BDBM293803
Substrate
Meas. Tech.
JMJD2C Assay
Temperature
298.15±n/a K
IC50
<100±n/a nM
Comments
extracted
Citation
 Boloor, AChen, YKWallace, MB Histone demethylase inhibitors US Patent  US10106534 Publication Date 10/23/2018 
Target
Name:
Lysine-specific demethylase 4C
Synonyms:
GASC-1 protein Gene amplified in squamous cell carcinoma 1 protein JMJD2C Jumonji domain-containing protein 2C KDM4C_HUMAN | KIAA0780
Type:
Protein
Mol. Mass.:
119979.01
Organism:
Homo sapiens (Human)
Description:
Q9H3R0
Residue:
1056
  
Inhibitor
Name:
BDBM293803
Synonyms:
3-({[(4R)-7-[methyl(5-methylpyridin-2-yl)amino]-3,4-dihydro-2H- | US10106534, Example 145
Type:
Small organic molecule
Emp. Form.:
C23H24N4O3
Mol. Mass.:
404.4617
SMILES:
CN(c1ccc2[C@H](CNc3cnccc3C(O)=O)CCOc2c1)c1ccc(C)cn1
: