Target
Hexokinase-4
Ligand
BDBM239065
Substrate
Meas. Tech.
Activation Assay
pH
7.1±n/a
EC50
2000±n/a nM
Citation
 Kang, XLong, WMa, CWang, YShen, XHu, YTan, FWang, Y Compound for increasing kinase active and application thereof US Patent  US9409900 Publication Date 8/9/2016 
Target
Name:
Hexokinase-4
Synonyms:
Gck Glucokinase HK4 Hexokinase-4 | Hexokinase-D
Type:
Enzyme
Mol. Mass.:
52075.40
Organism:
Mus musculus (Mouse)
Description:
P52792
Residue:
465
  
Inhibitor
Name:
BDBM239065
Synonyms:
US9409900, 6
Type:
Small organic molecule
Emp. Form.:
C23H22N4O6S
Mol. Mass.:
482.509
SMILES:
CS(=O)(=O)c1ccc(Oc2ccc(Nc3ccc(cn3)C(O)=O)cc2CN2CCCC2=O)cn1
: