Target
Hexokinase-4
Ligand
BDBM239066
Substrate
Meas. Tech.
Activation Assay
pH
7.1±n/a
EC50
2000±n/a nM
Citation
 Kang, XLong, WMa, CWang, YShen, XHu, YTan, FWang, Y Compound for increasing kinase active and application thereof US Patent  US9409900 Publication Date 8/9/2016 
Target
Name:
Hexokinase-4
Synonyms:
Gck Glucokinase HK4 Hexokinase-4 | Hexokinase-D
Type:
Enzyme
Mol. Mass.:
52075.40
Organism:
Mus musculus (Mouse)
Description:
P52792
Residue:
465
  
Inhibitor
Name:
BDBM239066
Synonyms:
US9409900, 13
Type:
Small organic molecule
Emp. Form.:
C21H22N4O4S2
Mol. Mass.:
458.554
SMILES:
Cc1cnc(Nc2ccc(Oc3ccc(nc3)S(C)(=O)=O)c(CN3CCCC3=O)c2)s1
: