Target
Siderophore-binding protein
Ligand
BDBM11611
Substrate
Meas. Tech.
CA Inhibition Assay
pH
8.3±0
Temperature
298.15±0 K
Ki
2.03e+3±n/a nM
Citation
 Maresca, AScozzafava, AVullo, DSupuran, CT Dihalogenated sulfanilamides and benzolamides are effective inhibitors of the three ß-class carbonic anhydrases from Mycobacterium tuberculosis. J Enzyme Inhib Med Chem 28:384-7 (2013)  
Target
Name:
Siderophore-binding protein
Synonyms:
β-Carbonic anhydrase 3 (CA 3)
Type:
Enzyme
Mol. Mass.:
17663.22
Organism:
Mycobacterium tuberculosis
Description:
Residue:
174
  
Inhibitor
Name:
BDBM11611
Synonyms:
β-CA inhibitor, 10 4-amino-3,5-dibromobenzene-1-sulfonamide halogenosulfanilamide deriv. 12
Type:
Small organic molecule
Emp. Form.:
C6H6Br2N2O2S
Mol. Mass.:
329.997
SMILES:
Nc1c(Br)cc(cc1Br)S(N)(=O)=O
: