Target
Orexin/Hypocretin receptor type 1
Ligand
BDBM240226
Substrate
Meas. Tech.
Intracellular Calcium Assay
Temperature
310.15±n/a K
IC50
315±n/a nM
Comments
extracted
Citation
 Bolli, MBoss, CBrotschi, CHeidmann, BSifferlen, TWilliams, JT Azetidine amide derivatives as orexin receptor antagonists US Patent  US9403813 Publication Date 8/2/2016 
Target
Name:
Orexin/Hypocretin receptor type 1
Synonyms:
HCRTR1 OX1R_HUMAN Orexin receptor type 1 (OR 1) Orexin receptor type 1 (OX1) Orexin receptor type 1 (OxR1) | Ox1r
Type:
Protein
Mol. Mass.:
47554.50
Organism:
Homo sapiens (Human)
Description:
O43613
Residue:
425
  
Inhibitor
Name:
BDBM240226
Synonyms:
US9403813, 132
Type:
Small organic molecule
Emp. Form.:
C21H15ClF3N7O2
Mol. Mass.:
489.838
SMILES:
FC(F)(F)Oc1ccccc1-c1nnc([nH]1)[C@@H]1CCN1C(=O)c1ccc(Cl)cc1-n1nccn1
: