Target
Trace amine-associated receptor 1
Ligand
BDBM240677
Substrate
Meas. Tech.
Radioligand Binding (rat TAAR1)
pH
7.4±n/a
Ki
3.2±n/a nM
Comments
extracted
Citation
 Galley, GGhellamallah, CNorcross, RPflieger, P Triazole carboxamides and uses thereof US Patent  US9416127 Publication Date 8/16/2016 
Target
Name:
Trace amine-associated receptor 1
Synonyms:
TAAR1_RAT Taar1 Trace amine receptor 1 (TARR1) Trace amine-associated receptor 1 (TAAR1) Trar1
Type:
Enzyme
Mol. Mass.:
38034.73
Organism:
Rattus norvegicus (Rat)
Description:
Q923Y9
Residue:
332
  
Inhibitor
Name:
BDBM240677
Synonyms:
US9416127, 14 | US9416127, 15
Type:
Small organic molecule
Emp. Form.:
C20H18F3N5O3
Mol. Mass.:
433.3838
SMILES:
FC(F)(F)Oc1ccc(cc1)-n1ncc(n1)C(=O)Nc1ccc(cc1)[C@H]1CNCCO1
: