Target
Ectonucleotide pyrophosphatase/phosphodiesterase family member 2
Ligand
BDBM241094
Substrate
Meas. Tech.
Inhibition Assay
IC50
313±n/a nM
Citation
 Legrand, DMFurminger, VThomson, CHughes, ORStanley, E Autotaxin inhibitors US Patent  US9409895 Publication Date 8/9/2016 
Target
Name:
Ectonucleotide pyrophosphatase/phosphodiesterase family member 2
Synonyms:
ATX Autotaxin (ATX) ENPP2 Ectonucleotide Pyrophosphatase/Phosphodiesterase 2 (ENPP2) Extracellular lysophospholipase D PDNP2
Type:
Enzyme
Mol. Mass.:
99007.13
Organism:
Homo sapiens (Human)
Description:
Q13822
Residue:
863
  
Inhibitor
Name:
BDBM241094
Synonyms:
US9409895, 5 | US9630945, 5
Type:
Small organic molecule
Emp. Form.:
C21H25Cl2N3O5
Mol. Mass.:
470.346
SMILES:
CC1CC(CNC(=O)CCc2cc(O)no2)CCN1C(=O)OCc1cc(Cl)cc(Cl)c1
: