Target
Ectonucleotide pyrophosphatase/phosphodiesterase family member 2
Ligand
BDBM241097
Substrate
Meas. Tech.
Inhibition Assay
IC50
360±n/a nM
Citation
 Legrand, DMFurminger, VThomson, CHughes, ORStanley, E Autotaxin inhibitors US Patent  US9409895 Publication Date 8/9/2016 
Target
Name:
Ectonucleotide pyrophosphatase/phosphodiesterase family member 2
Synonyms:
ATX Autotaxin (ATX) ENPP2 Ectonucleotide Pyrophosphatase/Phosphodiesterase 2 (ENPP2) Extracellular lysophospholipase D PDNP2
Type:
Enzyme
Mol. Mass.:
99007.13
Organism:
Homo sapiens (Human)
Description:
Q13822
Residue:
863
  
Inhibitor
Name:
BDBM241097
Synonyms:
US9409895, 8 | US9630945, 8
Type:
Small organic molecule
Emp. Form.:
C21H25Cl2N3O5
Mol. Mass.:
470.346
SMILES:
CN(CCC1CCN(CC1)C(=O)OCc1cc(Cl)cc(Cl)c1)C(=O)c1[nH]c(=O)oc1C
: