Target
Ectonucleotide pyrophosphatase/phosphodiesterase family member 2
Ligand
BDBM241100
Substrate
Meas. Tech.
Inhibition Assay
IC50
51±n/a nM
Citation
 Legrand, DMFurminger, VThomson, CHughes, ORStanley, E Autotaxin inhibitors US Patent  US9409895 Publication Date 8/9/2016 
Target
Name:
Ectonucleotide pyrophosphatase/phosphodiesterase family member 2
Synonyms:
ATX Autotaxin (ATX) ENPP2 Ectonucleotide Pyrophosphatase/Phosphodiesterase 2 (ENPP2) Extracellular lysophospholipase D PDNP2
Type:
Enzyme
Mol. Mass.:
99007.13
Organism:
Homo sapiens (Human)
Description:
Q13822
Residue:
863
  
Inhibitor
Name:
BDBM241100
Synonyms:
US9409895, 11 | US9630945, 11
Type:
Small organic molecule
Emp. Form.:
C20H22Cl2N2O6
Mol. Mass.:
457.304
SMILES:
CCOc1c(NCCC2CN(CCO2)C(=O)OCc2cc(Cl)cc(Cl)c2)c(=O)c1=O
: