Target
Ectonucleotide pyrophosphatase/phosphodiesterase family member 2
Ligand
BDBM241122
Substrate
Meas. Tech.
Inhibition Assay
IC50
131±n/a nM
Citation
 Legrand, DMFurminger, VThomson, CHughes, ORStanley, E Autotaxin inhibitors US Patent  US9409895 Publication Date 8/9/2016 
Target
Name:
Ectonucleotide pyrophosphatase/phosphodiesterase family member 2
Synonyms:
ATX Autotaxin (ATX) ENPP2 Ectonucleotide Pyrophosphatase/Phosphodiesterase 2 (ENPP2) Extracellular lysophospholipase D PDNP2
Type:
Enzyme
Mol. Mass.:
99007.13
Organism:
Homo sapiens (Human)
Description:
Q13822
Residue:
863
  
Inhibitor
Name:
BDBM241122
Synonyms:
US9409895, 33 | US9630945, 33
Type:
Small organic molecule
Emp. Form.:
C20H23Cl2N3O5
Mol. Mass.:
456.32
SMILES:
Oc1cc(CCC(=O)NCC2CCN(CC2)C(=O)OCc2cc(Cl)cc(Cl)c2)on1
: