Target
Ectonucleotide pyrophosphatase/phosphodiesterase family member 2
Ligand
BDBM241126
Substrate
Meas. Tech.
Inhibition Assay
IC50
55±n/a nM
Citation
 Legrand, DMFurminger, VThomson, CHughes, ORStanley, E Autotaxin inhibitors US Patent  US9409895 Publication Date 8/9/2016 
Target
Name:
Ectonucleotide pyrophosphatase/phosphodiesterase family member 2
Synonyms:
ATX Autotaxin (ATX) ENPP2 Ectonucleotide Pyrophosphatase/Phosphodiesterase 2 (ENPP2) Extracellular lysophospholipase D PDNP2
Type:
Enzyme
Mol. Mass.:
99007.13
Organism:
Homo sapiens (Human)
Description:
Q13822
Residue:
863
  
Inhibitor
Name:
BDBM241126
Synonyms:
US9409895, 37 | US9630945, 37
Type:
Small organic molecule
Emp. Form.:
C19H23ClFN5O3
Mol. Mass.:
423.869
SMILES:
Fc1cc(Cl)cc(COC(=O)N2CCC(CC2)NC(=O)CCCc2c[nH]nn2)c1
: