Target
Ectonucleotide pyrophosphatase/phosphodiesterase family member 2
Ligand
BDBM241131
Substrate
Meas. Tech.
Inhibition Assay
IC50
119±n/a nM
Citation
 Legrand, DMFurminger, VThomson, CHughes, ORStanley, E Autotaxin inhibitors US Patent  US9409895 Publication Date 8/9/2016 
Target
Name:
Ectonucleotide pyrophosphatase/phosphodiesterase family member 2
Synonyms:
ATX Autotaxin (ATX) ENPP2 Ectonucleotide Pyrophosphatase/Phosphodiesterase 2 (ENPP2) Extracellular lysophospholipase D PDNP2
Type:
Enzyme
Mol. Mass.:
99007.13
Organism:
Homo sapiens (Human)
Description:
Q13822
Residue:
863
  
Inhibitor
Name:
BDBM241131
Synonyms:
US9409895, 42 | US9630945, 42
Type:
Small organic molecule
Emp. Form.:
C20H25Cl2N5O2
Mol. Mass.:
438.351
SMILES:
Clc1cc(Cl)cc(CCC(=O)N2CCC(CC2)NC(=O)CCCc2c[nH]nn2)c1
: