Target
Ectonucleotide pyrophosphatase/phosphodiesterase family member 2
Ligand
BDBM241138
Substrate
Meas. Tech.
Inhibition Assay
IC50
48±n/a nM
Citation
 Legrand, DMFurminger, VThomson, CHughes, ORStanley, E Autotaxin inhibitors US Patent  US9409895 Publication Date 8/9/2016 
Target
Name:
Ectonucleotide pyrophosphatase/phosphodiesterase family member 2
Synonyms:
ATX Autotaxin (ATX) ENPP2 Ectonucleotide Pyrophosphatase/Phosphodiesterase 2 (ENPP2) Extracellular lysophospholipase D PDNP2
Type:
Enzyme
Mol. Mass.:
99007.13
Organism:
Homo sapiens (Human)
Description:
Q13822
Residue:
863
  
Inhibitor
Name:
BDBM241138
Synonyms:
US9409895, 49 | US9630945, 49
Type:
Small organic molecule
Emp. Form.:
C18H21Cl2N5O3
Mol. Mass.:
426.297
SMILES:
Clc1cc(Cl)cc(COC(=O)N2CCC(C2)NC(=O)CCCc2c[nH]nn2)c1
: