Target
Ectonucleotide pyrophosphatase/phosphodiesterase family member 2
Ligand
BDBM241143
Substrate
Meas. Tech.
Inhibition Assay
IC50
40±n/a nM
Citation
 Legrand, DMFurminger, VThomson, CHughes, ORStanley, E Autotaxin inhibitors US Patent  US9409895 Publication Date 8/9/2016 
Target
Name:
Ectonucleotide pyrophosphatase/phosphodiesterase family member 2
Synonyms:
ATX Autotaxin (ATX) ENPP2 Ectonucleotide Pyrophosphatase/Phosphodiesterase 2 (ENPP2) Extracellular lysophospholipase D PDNP2
Type:
Enzyme
Mol. Mass.:
99007.13
Organism:
Homo sapiens (Human)
Description:
Q13822
Residue:
863
  
Inhibitor
Name:
BDBM241143
Synonyms:
US9409895, 53 | US9630945, 53
Type:
Small organic molecule
Emp. Form.:
C20H24F3N5O3
Mol. Mass.:
439.4315
SMILES:
FC(F)(F)c1ccc(COC(=O)N2CCC(CC2)NC(=O)CCCc2c[nH]nn2)cc1
: