Target
Dual specificity protein kinase TTK
Ligand
BDBM241188
Substrate
Meas. Tech.
Enzyme Inhibition Assay
pH
7±n/a
Temperature
298.15±n/a K
IC50
74±n/a nM
Comments
extracted
Citation
 Hoelder, SBlagg, JSolanki, SWoodward, HNaud, SBavetsias, VSheldrake, PInnocenti, PCheung, KJAtrash, B Inhibitor compounds US Patent  US9409907 Publication Date 8/9/2016 
Target
Name:
Dual specificity protein kinase TTK
Synonyms:
Dual specificity protein kinase (TTK) MPS1 Monopolar Spindle 1 (MPS1) Monopolar Spindle 1 Kinase (MPS1) TTK | TTK_HUMAN
Type:
Protein
Mol. Mass.:
97086.79
Organism:
Homo sapiens (Human)
Description:
P33981
Residue:
857
  
Inhibitor
Name:
BDBM241188
Synonyms:
US11046688, Example 30 | US9409907, 30
Type:
Small organic molecule
Emp. Form.:
C21H20N4O2
Mol. Mass.:
360.4091
SMILES:
COc1ccc(Nc2cc3c(cccc3cn2)-c2cnn(C)c2)c(OC)c1
: