Target
Genome polyprotein
Ligand
BDBM241940
Substrate
Meas. Tech.
FRET Assay
pH
7.8±n/a
Temperature
298.15±n/a K
IC50
290±n/a nM
Comments
extracted
Citation
 Niu, DPetter, RCQiao, LSingh, J HCV protease inhibitors and uses thereof US Patent  US9422333 Publication Date 8/23/2016 
Target
Name:
Genome polyprotein
Synonyms:
Protease NS3/Non-structural protein 4A (NS3/NS4A) | Protease NS3/Non-structural protein 4A (NS3/NS4A) (D168V)
Type:
Enzyme
Mol. Mass.:
19121.30
Organism:
Hepatitis C virus genotype 1b (isolate Con1) (HCV)
Description:
Q91RS4
Residue:
181
  
Inhibitor
Name:
BDBM241940
Synonyms:
US9422333, I-1
Type:
Small organic molecule
Emp. Form.:
C27H42N6O6
Mol. Mass.:
546.659
SMILES:
CC(C)(C)NC(=O)N[C@@H](CNC(=O)C=C)C(=O)N1CC2[C@@H]([C@H]1C(=O)NC(CC1CCC1)C(=O)C(N)=O)C2(C)C
: