Target
Neurogenic locus notch homolog protein 1/Recombining binding protein suppressor of hairless
Ligand
BDBM242883
Substrate
Meas. Tech.
Transactivation Assay
IC50
2.1±n/a nM
Citation
 Zhao, YGavai, AVGill, PKim, SFink, BEChen, LSaulnier, MGHan, W Fluoroalkyl and fluorocycloalkyl 1,4-benzodiazepinone compounds US Patent  US9427442 Publication Date 8/30/2016 
Target
Name:
Neurogenic locus notch homolog protein 1/Recombining binding protein suppressor of hairless
Synonyms:
Notch 1-CBF1 | Notch1-CBF1
Type:
Enzyme
Mol. Mass.:
Description:
Components:
This complex has 2 components.
Component 1
Name:
Neurogenic locus notch homolog protein 1
Synonyms:
NEXT NOTC1_HUMAN Neurogenic locus notch homolog protein 1 Notch 1 Notch 1 intracellular domain TAN1 hN1
Type:
Enzyme
Mol. Mass.:
272417.95
Organism:
Homo sapiens (Human)
Description:
P46531
Residue:
2555
  
Component 2
Name:
Recombining binding protein suppressor of hairless
Synonyms:
C-promoter binding factor I (CBF1) IGKJRB1 RBPJK Recombining binding protein suppressor of hairless (CBF1) | SUH_HUMAN
Type:
Enzyme
Mol. Mass.:
55640.53
Organism:
Homo sapiens (Human)
Description:
Q06330
Residue:
500
  
Inhibitor
Name:
BDBM242883
Synonyms:
US9427442, 11
Type:
Small organic molecule
Emp. Form.:
C28H28F6N4O3
Mol. Mass.:
582.5373
SMILES:
Cc1cccc(c1)C1=N[C@H](NC(=O)[C@H](CCC(F)(F)F)[C@H](CC2CC(F)(F)C2)C(N)=O)C(=O)Nc2c(F)cccc12
: