Target
Serum paraoxonase/arylesterase 1
Ligand
BDBM243044
Substrate
Meas. Tech.
Enzyme Activity Assay
IC50
1.23e+5±n/a nM
Citation
 Akbaba, YTürkes, CPolat, LSöyüt, HSahin, EMenzek, AGöksu, SBeydemir, S Synthesis and paroxonase activities of novel bromophenols. J Enzyme Inhib Med Chem 28:1073-9 (2013)  
Target
Name:
Serum paraoxonase/arylesterase 1
Synonyms:
A-esterase 1 K-45 PON 1 PON1_HUMAN Paraoxonase (hPON1) Serum aryldialkylphosphatase 1 | Serum paraoxonase 1 (PON1)
Type:
Enzyme
Mol. Mass.:
39719.73
Organism:
Homo sapiens (Human)
Description:
P27169
Residue:
355
  
Inhibitor
Name:
BDBM243044
Synonyms:
(2-Bromo-4,5-dimethoxyphenyl)(2,3-dibromo-5,6-dimethoxyphenyl)methanone (8)
Type:
Small organic molecule
Emp. Form.:
C17H15Br3O5
Mol. Mass.:
539.01
SMILES:
COc1cc(Br)c(cc1OC)C(=O)c1c(Br)c(Br)cc(OC)c1OC
: