Target
Serum paraoxonase/arylesterase 1
Ligand
BDBM243047
Substrate
Meas. Tech.
Enzyme Activity Assay
IC50
1.110e+6±n/a nM
Citation
 Akbaba, YTürkes, CPolat, LSöyüt, HSahin, EMenzek, AGöksu, SBeydemir, S Synthesis and paroxonase activities of novel bromophenols. J Enzyme Inhib Med Chem 28:1073-9 (2013)  
Target
Name:
Serum paraoxonase/arylesterase 1
Synonyms:
A-esterase 1 K-45 PON 1 PON1_HUMAN Paraoxonase (hPON1) Serum aryldialkylphosphatase 1 | Serum paraoxonase 1 (PON1)
Type:
Enzyme
Mol. Mass.:
39719.73
Organism:
Homo sapiens (Human)
Description:
P27169
Residue:
355
  
Inhibitor
Name:
BDBM243047
Synonyms:
(2-Bromo-4,5-dihydroxyphenyl)(2,3-dibromo-5,6-dihydroxyphenyl)methanone (11)
Type:
Small organic molecule
Emp. Form.:
C13H7Br3O5
Mol. Mass.:
482.904
SMILES:
Oc1cc(Br)c(cc1O)C(=O)c1c(O)c(O)cc(Br)c1Br
: