Target
Tyrosine-protein phosphatase non-receptor type 1
Ligand
BDBM243051
Substrate
Meas. Tech.
Enzymatic Assay
pH
6.5±0
Temperature
303.15±0 K
IC50
2.66e+3± 2.3e+2 nM
Citation
 Sun, LPMa, WPGao, LXYang, LLQuan, YCLi, JPiao, HR Synthesis and characterization of 5,7-dihydroxyflavanone derivatives as novel protein tyrosine phosphatase 1B inhibitors. J Enzyme Inhib Med Chem 28:1199-204 (2013)  
Target
Name:
Tyrosine-protein phosphatase non-receptor type 1
Synonyms:
PTN1_HUMAN PTPN1 Protein tyrosine phosphatase-1B (PTP1B) Protein-tyrosine phosphatase 1B (PTP1B) Tyrosine-protein phosphatase non-receptor type 1 (PTP1B)
Type:
Protein phosphatase
Mol. Mass.:
49963.76
Organism:
Homo sapiens (Human)
Description:
Human recombinant GST-fusion PTP1B (1-435).
Residue:
435
  
Inhibitor
Name:
BDBM243051
Synonyms:
PTP inhibitor, 4c
Type:
Small organic molecule
Emp. Form.:
C15H11FO4
Mol. Mass.:
274.2438
SMILES:
Oc1cc(O)c2C(=O)CC(Oc2c1)c1ccc(F)cc1
: