Target
Tyrosine-protein phosphatase non-receptor type 1
Ligand
BDBM243056
Substrate
Meas. Tech.
Enzymatic Assay
pH
6.5±0
Temperature
303.15±0 K
IC50
4.90e+3± 9.8e+2 nM
Citation
 Sun, LPMa, WPGao, LXYang, LLQuan, YCLi, JPiao, HR Synthesis and characterization of 5,7-dihydroxyflavanone derivatives as novel protein tyrosine phosphatase 1B inhibitors. J Enzyme Inhib Med Chem 28:1199-204 (2013)  
Target
Name:
Tyrosine-protein phosphatase non-receptor type 1
Synonyms:
PTN1_HUMAN PTPN1 Protein tyrosine phosphatase-1B (PTP1B) Protein-tyrosine phosphatase 1B (PTP1B) Tyrosine-protein phosphatase non-receptor type 1 (PTP1B)
Type:
Protein phosphatase
Mol. Mass.:
49963.76
Organism:
Homo sapiens (Human)
Description:
Human recombinant GST-fusion PTP1B (1-435).
Residue:
435
  
Inhibitor
Name:
BDBM243056
Synonyms:
PTP inhibitor, 4h
Type:
Small organic molecule
Emp. Form.:
C15H11BrO4
Mol. Mass.:
335.149
SMILES:
Oc1cc(O)c2C(=O)CC(Oc2c1)c1ccccc1Br
: