Target
M-phase inducer phosphatase 2
Ligand
BDBM243059
Substrate
Meas. Tech.
Enzymatic Assay
pH
6.5±0
Temperature
303.15±0 K
IC50
8.54e+3± 1.51e+3 nM
Citation
 Sun, LPMa, WPGao, LXYang, LLQuan, YCLi, JPiao, HR Synthesis and characterization of 5,7-dihydroxyflavanone derivatives as novel protein tyrosine phosphatase 1B inhibitors. J Enzyme Inhib Med Chem 28:1199-204 (2013)  
Target
Name:
M-phase inducer phosphatase 2
Synonyms:
CDC25B Dual specificity phosphatase (CDC25B) M-phase inducer phosphatase 2 (CDC25B) | MPIP2_HUMAN
Type:
Protein
Mol. Mass.:
64985.27
Organism:
Homo sapiens (Human)
Description:
Residue:
580
  
Inhibitor
Name:
BDBM243059
Synonyms:
PTP inhibitor, 4k
Type:
Small organic molecule
Emp. Form.:
C16H11F3O4
Mol. Mass.:
324.2513
SMILES:
Oc1cc(O)c2C(=O)CC(Oc2c1)c1cccc(c1)C(F)(F)F
: